Target
Serine/threonine-protein kinase/endoribonuclease IRE1
Ligand
BDBM50547985
Substrate
Meas. Tech.
ChEMBL_2019487 (CHEMBL4673065)
IC50
67±n/a nM
Citation
 Beveridge, REWallweber, HAAshkenazi, ABeresini, MClark, KRGibbons, PGhiro, EKaufman, SLarivée, ALeblanc, MLeclerc, JPLemire, ALy, CRudolph, JSchwarz, JBSrivastava, SWang, WZhao, LBraun, MG Identification of BRaf-Sparing Amino-Thienopyrimidines with Potent IRE1? Inhibitory Activity. ACS Med Chem Lett 11:2389-2396 (2020)  
Target
Name:
Serine/threonine-protein kinase/endoribonuclease IRE1
Synonyms:
ERN1 Endoplasmic reticulum-to-nucleus signaling 1 IRE1 Inositol requiring enzyme 1 (IRE-1alpha) Inositol-requiring protein 1 Ire1-alpha Serine/threonine-protein kinase/endoribonuclease IRE1 hIRE1p
Type:
Enzyme
Mol. Mass.:
109731.20
Organism:
Homo sapiens (Human)
Description:
O75460
Residue:
977
  
Inhibitor
Name:
BDBM50547985
Synonyms:
CHEMBL4749470
Type:
Small organic molecule
Emp. Form.:
C19H11ClF3N5O3S2
Mol. Mass.:
513.901
SMILES:
Nc1ncnc2c(csc12)C(=O)Nc1c(Cl)ccc(NS(=O)(=O)c2cc(F)ccc2F)c1F
: