Target
Serine/threonine-protein kinase/endoribonuclease IRE1
Ligand
BDBM50547975
Substrate
Meas. Tech.
ChEMBL_2019488 (CHEMBL4673066)
IC50
2000±n/a nM
Citation
 Beveridge, REWallweber, HAAshkenazi, ABeresini, MClark, KRGibbons, PGhiro, EKaufman, SLarivée, ALeblanc, MLeclerc, JPLemire, ALy, CRudolph, JSchwarz, JBSrivastava, SWang, WZhao, LBraun, MG Identification of BRaf-Sparing Amino-Thienopyrimidines with Potent IRE1? Inhibitory Activity. ACS Med Chem Lett 11:2389-2396 (2020)  
Target
Name:
Serine/threonine-protein kinase/endoribonuclease IRE1
Synonyms:
ERN1 Endoplasmic reticulum-to-nucleus signaling 1 IRE1 Inositol requiring enzyme 1 (IRE-1alpha) Inositol-requiring protein 1 Ire1-alpha Serine/threonine-protein kinase/endoribonuclease IRE1 hIRE1p
Type:
Enzyme
Mol. Mass.:
109731.20
Organism:
Homo sapiens (Human)
Description:
O75460
Residue:
977
  
Inhibitor
Name:
BDBM50547975
Synonyms:
CHEMBL4759829
Type:
Small organic molecule
Emp. Form.:
C25H17ClF3N7O3S
Mol. Mass.:
587.961
SMILES:
Cn1nccc1-c1cc(C(=O)Nc2c(Cl)ccc(NS(=O)(=O)c3cc(F)ccc3F)c2F)c2ncnc(N)c2c1
: