Target
Serine/threonine-protein kinase B-raf
Ligand
BDBM50547987
Substrate
Meas. Tech.
ChEMBL_2019489 (CHEMBL4673067)
Ki
55±n/a nM
Citation
 Beveridge, REWallweber, HAAshkenazi, ABeresini, MClark, KRGibbons, PGhiro, EKaufman, SLarivée, ALeblanc, MLeclerc, JPLemire, ALy, CRudolph, JSchwarz, JBSrivastava, SWang, WZhao, LBraun, MG Identification of BRaf-Sparing Amino-Thienopyrimidines with Potent IRE1? Inhibitory Activity. ACS Med Chem Lett 11:2389-2396 (2020)  
Target
Name:
Serine/threonine-protein kinase B-raf
Synonyms:
B-RAF B-Raf proto-oncogene serine/threonine-protein kinase BRAF1 RAFB1 v-Raf murine sarcoma viral oncogene homolog B1
Type:
Serine/threonine-protein kinase
Mol. Mass.:
84446.00
Organism:
Homo sapiens (Human)
Description:
P15056
Residue:
766
  
Inhibitor
Name:
BDBM50547987
Synonyms:
CHEMBL4760343
Type:
Small organic molecule
Emp. Form.:
C26H27Cl2FN6O3S2
Mol. Mass.:
625.565
SMILES:
Cl.N[C@H]1CC[C@@H](CC1)Nc1ncnc2c(csc12)C(=O)Nc1c(Cl)ccc(NS(=O)(=O)Cc2ccccc2)c1F
: