Target
REST corepressor 1
Ligand
BDBM50507295
Substrate
Meas. Tech.
ChEMBL_2019735 (CHEMBL4673548)
Kd
243±n/a nM
Citation
 Mehndiratta, SLiou, JP Histone lysine specific demethylase 1 inhibitors. RSC Med Chem 11:969-981 (2020)  
Target
Name:
REST corepressor 1
Synonyms:
KIAA0071 RCOR RCOR1_HUMAN | REST corepressor 1
Type:
PROTEIN
Mol. Mass.:
53329.34
Organism:
Homo sapiens (Human)
Description:
ChEMBL_108118
Residue:
485
  
Inhibitor
Name:
BDBM50507295
Synonyms:
CHEMBL1232432
Type:
Small organic molecule
Emp. Form.:
C27H38N6O2
Mol. Mass.:
478.6296
SMILES:
COc1cc2nc(NCCCN(C)C)nc(NC3CCN(Cc4ccccc4)CC3)c2cc1OC
: