Target
Dihydrofolate reductase
Ligand
BDBM18510
Substrate
Meas. Tech.
ChEMBL_52830 (CHEMBL665036)
IC50
49±n/a nM
Citation
 Rosowsky, AForsch, RAQueener, SF Inhibition of Pneumocystis carinii, Toxoplasma gondii, and Mycobacterium avium dihydrofolate reductases by 2,4-diamino-5-[2-methoxy-5-(omega-carboxyalkyloxy)benzyl]pyrimidines: marked improvement in potency relative to trimethoprim and species selectivity relative to piritrexim. J Med Chem 45:233-41 (2001)  
Target
Name:
Dihydrofolate reductase
Synonyms:
Dihydrofolate reductase (F31V) | dfrA17
Type:
Mol. Mass.:
17532.46
Organism:
Escherichia coli
Description:
Residue:
157
  
Inhibitor
Name:
BDBM18510
Synonyms:
5-{3-[(2,4-diaminopyrimidin-5-yl)methyl]-4-methoxyphenoxy}pentanoic acid Diaminopyrimidine, 22
Type:
Small organic molecule
Emp. Form.:
C17H22N4O4
Mol. Mass.:
346.381
SMILES:
COc1ccc(OCCCCC(O)=O)cc1Cc1cnc(N)nc1N
: