Target
Protein mono-ADP-ribosyltransferase PARP11
Ligand
BDBM207624
Substrate
Meas. Tech.
ChEMBL_2024711 (CHEMBL4678524)
IC50
2700±n/a nM
Citation
 Wang, HRen, BLiu, YJiang, BGuo, YWei, MLuo, LKuang, XQiu, MLv, LXu, HQi, RYan, HXu, DWang, ZHuo, CXZhu, YZhao, YWu, YQin, ZSu, DTang, TWang, FSun, XFeng, YPeng, HWang, XGao, YLiu, YGong, WYu, FLiu, XWang, LZhou, C Discovery of Pamiparib (BGB-290), a Potent and Selective Poly (ADP-ribose) Polymerase (PARP) Inhibitor in Clinical Development. J Med Chem 63:15541-15563 (2020)  
Target
Name:
Protein mono-ADP-ribosyltransferase PARP11
Synonyms:
2.4.2.30 ARTD11 PAR11_HUMAN PARP11 | Poly [ADP-ribose] polymerase 11
Type:
PROTEIN
Mol. Mass.:
39601.40
Organism:
Homo sapiens
Description:
ChEMBL_107591
Residue:
338
  
Inhibitor
Name:
BDBM207624
Synonyms:
US10501467, Example 69 US9617273, Example 69
Type:
Small organic molecule
Emp. Form.:
C16H15FN4O
Mol. Mass.:
298.3149
SMILES:
C[C@]12CCCN1Cc1n[nH]c(=O)c3cc(F)cc4[nH]c2c1c34
: