Target
Poly [ADP-ribose] polymerase 2
Ligand
BDBM207573
Substrate
Meas. Tech.
ChEMBL_2024727 (CHEMBL4678540)
IC50
1.3±n/a nM
Citation
 Wang, HRen, BLiu, YJiang, BGuo, YWei, MLuo, LKuang, XQiu, MLv, LXu, HQi, RYan, HXu, DWang, ZHuo, CXZhu, YZhao, YWu, YQin, ZSu, DTang, TWang, FSun, XFeng, YPeng, HWang, XGao, YLiu, YGong, WYu, FLiu, XWang, LZhou, C Discovery of Pamiparib (BGB-290), a Potent and Selective Poly (ADP-ribose) Polymerase (PARP) Inhibitor in Clinical Development. J Med Chem 63:15541-15563 (2020)  
Target
Name:
Poly [ADP-ribose] polymerase 2
Synonyms:
(ARTD2 or PARP2) ADPRTL2 PARP2_HUMAN Poly [ADP-ribose] polymerase 2 (PARP2)
Type:
Enzyme
Mol. Mass.:
66225.70
Organism:
Homo sapiens (Human)
Description:
Q9UGN5
Residue:
583
  
Inhibitor
Name:
BDBM207573
Synonyms:
US10501467, Example 18 US9617273, Example 18
Type:
Small organic molecule
Emp. Form.:
C14H12FN3O
Mol. Mass.:
257.263
SMILES:
CC1Cc2[nH]c3cc(F)cc4c3c2c(C1)n[nH]c4=O
: