Target
Catechol O-methyltransferase
Ligand
BDBM50108878
Substrate
Meas. Tech.
ChEMBL_47067 (CHEMBL661108)
IC50
696000±n/a nM
Citation
 Learmonth, DAVieira-Coelho, MABenes, JAlves, PCBorges, NFreitas, APda-Silva, PS Synthesis of 1-(3,4-dihydroxy-5-nitrophenyl)-2-phenyl-ethanone and derivatives as potent and long-acting peripheral inhibitors of catechol-O-methyltransferase. J Med Chem 45:685-95 (2002)  
Target
Name:
Catechol O-methyltransferase
Synonyms:
COMT_RAT Catechol-O-methyltransferase | Comt
Type:
Enzyme
Mol. Mass.:
29594.09
Organism:
Rattus norvegicus (Rat)
Description:
Residue:
264
  
Inhibitor
Name:
BDBM50108878
Synonyms:
1-(3,4-Dihydroxy-5-nitro-phenyl)-2-phenyl-ethanone CHEMBL160038 | NEBICAPONE
Type:
Small organic molecule
Emp. Form.:
C14H11NO5
Mol. Mass.:
273.2408
SMILES:
Oc1cc(cc(c1O)[N+]([O-])=O)C(=O)Cc1ccccc1
: