Target
Peroxisome proliferator-activated receptor gamma
Ligand
BDBM50109110
Substrate
Meas. Tech.
ChEMBL_154205 (CHEMBL759450)
IC50
44000±n/a nM
Citation
 Miyachi, HNomura, MTanase, TSuzuki, MMurakami, KAwano, K Enantio-dependent binding and transactivation of optically active phenylpropanoic acid derivatives at human peroxisome proliferator-activated receptor alpha. Bioorg Med Chem Lett 12:333-5 (2002)  
Target
Name:
Peroxisome proliferator-activated receptor gamma
Synonyms:
NR1C3 PPAR-gamma PPARG_HUMAN Peroxisome proliferator-activated receptor gamma (PPAR gamma) Peroxisome proliferator-activated receptor gamma (PPARĪ³) peroxisome proliferator-activated receptor gamma isoform 2
Type:
Nuclear Receptor
Mol. Mass.:
57613.46
Organism:
Homo sapiens (Human)
Description:
P37231
Residue:
505
  
Inhibitor
Name:
BDBM50109110
Synonyms:
(S)-2-(4-methoxy-3-(4-(trifluoromethyl)benzylcarbamoyl)benzyl)butanoic acid CHEMBL107789
Type:
Small organic molecule
Emp. Form.:
C21H22F3NO4
Mol. Mass.:
409.3989
SMILES:
CC[C@@H](Cc1ccc(OC)c(c1)C(=O)NCc1ccc(cc1)C(F)(F)F)C(O)=O
: