Target
Peroxisome proliferator-activated receptor alpha
Ligand
BDBM50109109
Substrate
Meas. Tech.
ChEBML_153244
EC50
1500±n/a nM
Citation
 Miyachi, HNomura, MTanase, TSuzuki, MMurakami, KAwano, K Enantio-dependent binding and transactivation of optically active phenylpropanoic acid derivatives at human peroxisome proliferator-activated receptor alpha. Bioorg Med Chem Lett 12:333-5 (2002)  
Target
Name:
Peroxisome proliferator-activated receptor alpha
Synonyms:
NR1C1 PPAR PPAR-alpha PPARA_HUMAN Peroxisome proliferator-activated receptor | Peroxisome proliferator-activated receptor alpha (PPAR alpha)
Type:
Enzyme
Mol. Mass.:
52222.08
Organism:
Homo sapiens (Human)
Description:
Q07869
Residue:
468
  
Inhibitor
Name:
BDBM50109109
Synonyms:
(R)-2-(4-methoxy-3-(4-(trifluoromethyl)benzylcarbamoyl)benzyl)butanoic acid CHEMBL115604
Type:
Small organic molecule
Emp. Form.:
C21H22F3NO4
Mol. Mass.:
409.3989
SMILES:
CC[C@H](Cc1ccc(OC)c(c1)C(=O)NCc1ccc(cc1)C(F)(F)F)C(O)=O
: