Target
Sphingosine 1-phosphate receptor 1
Ligand
BDBM197654
Substrate
Meas. Tech.
ChEMBL_2026979 (CHEMBL4681137)
EC50
0.310000±n/a nM
Target
Name:
Sphingosine 1-phosphate receptor 1
Synonyms:
CD_antigen=CD363 Endothelial differentiation G-protein coupled receptor 1 S1P receptor Edg-1 S1PR1_RAT Sphingosine 1-phosphate receptor Edg-1
Type:
PROTEIN
Mol. Mass.:
42770.88
Organism:
Rattus norvegicus
Description:
ChEMBL_1463793
Residue:
383
  
Inhibitor
Name:
BDBM197654
Synonyms:
US9216972, 7
Type:
Small organic molecule
Emp. Form.:
C26H20F3N3O4
Mol. Mass.:
495.4499
SMILES:
OC(=O)C1CN(Cc2ccc3-c4noc(c4CCc3c2)-c2onc(c2C(F)(F)F)-c2ccccc2)C1
: