Target
Cytochrome P450 1A2
Ligand
BDBM50550255
Substrate
Meas. Tech.
ChEMBL_2027338 (CHEMBL4681496)
IC50
>10000±n/a nM
Citation
 Ryu, JHLee, JAKim, SShin, YAYang, JHan, HYSon, HJKim, YHSa, JHKim, JSLee, JLee, JPark, HG Discovery of 2-((R)-4-(2-Fluoro-4-(methylsulfonyl)phenyl)-2-methylpiperazin-1-yl)-N-((1R,2s,3S,5S,7S)-5-hydroxyadamantan-2-yl)pyrimidine-4-carboxamide (SKI2852): A Highly Potent, Selective, and Orally Bioavailable Inhibitor of 11?-Hydroxysteroid Dehydrogenase Type 1 (11?-HSD1). J Med Chem 59:10176-10189 (2016)  
Target
Name:
Cytochrome P450 1A2
Synonyms:
CP1A2_HUMAN CYPIA2 Cytochrome P(3)450 Cytochrome P450 1A2 (CYP1A2) Cytochrome P450-P3
Type:
Enzyme
Mol. Mass.:
58423.38
Organism:
Homo sapiens (Human)
Description:
P05177
Residue:
516
  
Inhibitor
Name:
BDBM50550255
Synonyms:
CHEMBL4746745
Type:
Small organic molecule
Emp. Form.:
C29H39N5O3
Mol. Mass.:
505.6517
SMILES:
C[C@@H]1CN(CCN1c1cccc(n1)C(=O)NC1C2CC3CC1CC(O)(C3)C2)c1ccc(nc1)C(C)(C)O
: