Target
Cytochrome P450 2C9
Ligand
BDBM50550260
Substrate
Meas. Tech.
ChEMBL_2027339 (CHEMBL4681497)
IC50
>10000±n/a nM
Citation
 Ryu, JHLee, JAKim, SShin, YAYang, JHan, HYSon, HJKim, YHSa, JHKim, JSLee, JLee, JPark, HG Discovery of 2-((R)-4-(2-Fluoro-4-(methylsulfonyl)phenyl)-2-methylpiperazin-1-yl)-N-((1R,2s,3S,5S,7S)-5-hydroxyadamantan-2-yl)pyrimidine-4-carboxamide (SKI2852): A Highly Potent, Selective, and Orally Bioavailable Inhibitor of 11?-Hydroxysteroid Dehydrogenase Type 1 (11?-HSD1). J Med Chem 59:10176-10189 (2016)  
Target
Name:
Cytochrome P450 2C9
Synonyms:
(R)-limonene 6-monooxygenase CP2C9_HUMAN CYP2C9 Cytochrome P450 2C9 (CYP2C9 ) P-450MP P450 PB-1 | S-mephenytoin 4-hydroxylase
Type:
Enzyme
Mol. Mass.:
55636.33
Organism:
Homo sapiens (Human)
Description:
P11712
Residue:
490
  
Inhibitor
Name:
BDBM50550260
Synonyms:
CHEMBL4788862
Type:
Small organic molecule
Emp. Form.:
C27H35N5O4S
Mol. Mass.:
525.663
SMILES:
C[C@@H]1CN(CCN1c1nccc(n1)C(=O)NC1C2CC3CC1CC(O)(C3)C2)c1ccc(cc1)S(C)(=O)=O
: