Target
Cytochrome P450 3A4
Ligand
BDBM50550252
Substrate
Meas. Tech.
ChEMBL_2027342 (CHEMBL4681500)
IC50
>10000±n/a nM
Citation
 Ryu, JHLee, JAKim, SShin, YAYang, JHan, HYSon, HJKim, YHSa, JHKim, JSLee, JLee, JPark, HG Discovery of 2-((R)-4-(2-Fluoro-4-(methylsulfonyl)phenyl)-2-methylpiperazin-1-yl)-N-((1R,2s,3S,5S,7S)-5-hydroxyadamantan-2-yl)pyrimidine-4-carboxamide (SKI2852): A Highly Potent, Selective, and Orally Bioavailable Inhibitor of 11?-Hydroxysteroid Dehydrogenase Type 1 (11?-HSD1). J Med Chem 59:10176-10189 (2016)  
Target
Name:
Cytochrome P450 3A4
Synonyms:
Albendazole monooxygenase CP3A4_HUMAN CYP3A4 CYPIIIA4 Cytochrome P450 3A4 (CYP3A4) Nifedipine oxidase Taurochenodeoxycholate 6-alpha-hydroxylase
Type:
Enzyme
Mol. Mass.:
57349.57
Organism:
Homo sapiens (Human)
Description:
Residue:
503
  
Inhibitor
Name:
BDBM50550252
Synonyms:
CHEMBL4779054
Type:
Small organic molecule
Emp. Form.:
C28H36N6O3
Mol. Mass.:
504.6238
SMILES:
CNC(=O)c1ccc(cn1)N1CCN([C@H](C)C1)c1cccc(n1)C(=O)NC1C2CC3CC1CC(O)(C3)C2
: