Target
Histamine N-methyltransferase
Ligand
BDBM50110298
Substrate
Meas. Tech.
ChEMBL_87238 (CHEMBL696458)
IC50
49±n/a nM
Citation
 Apelt, JLigneau, XPertz, HHArrang, JMGanellin, CRSchwartz, JCSchunack, WStark, H Development of a new class of nonimidazole histamine H(3) receptor ligands with combined inhibitory histamine N-methyltransferase activity. J Med Chem 45:1128-41 (2002)  
Target
Name:
Histamine N-methyltransferase
Synonyms:
HNMT_RAT | Hnmt
Type:
PROTEIN
Mol. Mass.:
33931.03
Organism:
Rattus norvegicus
Description:
ChEMBL_87236
Residue:
295
  
Inhibitor
Name:
BDBM50110298
Synonyms:
CHEMBL277113 | Ethyl-(3-piperidin-1-yl-propyl)-quinolin-4-yl-amine; Oxalic acid
Type:
Small organic molecule
Emp. Form.:
C19H27N3
Mol. Mass.:
297.4378
SMILES:
CCN(CCCN1CCCCC1)c1ccnc2ccccc12
: