Target
Histamine N-methyltransferase
Ligand
BDBM50110301
Substrate
Meas. Tech.
ChEMBL_87238 (CHEMBL696458)
IC50
230±n/a nM
Citation
 Apelt, JLigneau, XPertz, HHArrang, JMGanellin, CRSchwartz, JCSchunack, WStark, H Development of a new class of nonimidazole histamine H(3) receptor ligands with combined inhibitory histamine N-methyltransferase activity. J Med Chem 45:1128-41 (2002)  
Target
Name:
Histamine N-methyltransferase
Synonyms:
HNMT_RAT | Hnmt
Type:
PROTEIN
Mol. Mass.:
33931.03
Organism:
Rattus norvegicus
Description:
ChEMBL_87236
Residue:
295
  
Inhibitor
Name:
BDBM50110301
Synonyms:
(7-Chloro-quinolin-4-yl)-(12-piperidin-1-yl-dodecyl)-amine; Oxalic acid | CHEMBL14283
Type:
Small organic molecule
Emp. Form.:
C26H40ClN3
Mol. Mass.:
430.069
SMILES:
Clc1ccc2c(NCCCCCCCCCCCCN3CCCCC3)ccnc2c1
: