Target
Histamine N-methyltransferase
Ligand
BDBM50110282
Substrate
Meas. Tech.
ChEMBL_87238 (CHEMBL696458)
IC50
120±n/a nM
Citation
 Apelt, JLigneau, XPertz, HHArrang, JMGanellin, CRSchwartz, JCSchunack, WStark, H Development of a new class of nonimidazole histamine H(3) receptor ligands with combined inhibitory histamine N-methyltransferase activity. J Med Chem 45:1128-41 (2002)  
Target
Name:
Histamine N-methyltransferase
Synonyms:
HNMT_RAT | Hnmt
Type:
PROTEIN
Mol. Mass.:
33931.03
Organism:
Rattus norvegicus
Description:
ChEMBL_87236
Residue:
295
  
Inhibitor
Name:
BDBM50110282
Synonyms:
(7-Chloro-quinolin-4-yl)-(7-piperidin-1-yl-heptyl)-amine; Oxalic acid | CHEMBL15101
Type:
Small organic molecule
Emp. Form.:
C21H30ClN3
Mol. Mass.:
359.936
SMILES:
Clc1ccc2c(NCCCCCCCN3CCCCC3)ccnc2c1
: