Target
Histamine N-methyltransferase
Ligand
BDBM50110313
Substrate
Meas. Tech.
ChEMBL_87238 (CHEMBL696458)
IC50
210±n/a nM
Citation
 Apelt, JLigneau, XPertz, HHArrang, JMGanellin, CRSchwartz, JCSchunack, WStark, H Development of a new class of nonimidazole histamine H(3) receptor ligands with combined inhibitory histamine N-methyltransferase activity. J Med Chem 45:1128-41 (2002)  
Target
Name:
Histamine N-methyltransferase
Synonyms:
HNMT_RAT | Hnmt
Type:
PROTEIN
Mol. Mass.:
33931.03
Organism:
Rattus norvegicus
Description:
ChEMBL_87236
Residue:
295
  
Inhibitor
Name:
BDBM50110313
Synonyms:
(2-Piperidin-1-yl-ethyl)-quinolin-4-yl-amine; Oxalic acid | CHEMBL280011
Type:
Small organic molecule
Emp. Form.:
C16H21N3
Mol. Mass.:
255.358
SMILES:
C(CN1CCCCC1)Nc1ccnc2ccccc12
: