Target
Tissue alpha-L-fucosidase
Ligand
BDBM32021
Substrate
Meas. Tech.
ChEMBL_2029541 (CHEMBL4683699)
IC50
32000±n/a nM
Citation
 Luthra, TBanothu, VAdepally, UKumar, KM, SChakrabarti, SMaddi, SRSen, S Discovery of novel pyrido-pyrrolidine hybrid compounds as alpha-glucosidase inhibitors and alternative agent for control of type 1 diabetes. Eur J Med Chem 188:0 (2020)  
Target
Name:
Tissue alpha-L-fucosidase
Synonyms:
Alpha-L-fucosidase 1 FUCO_BOVIN
Type:
PROTEIN
Mol. Mass.:
54093.12
Organism:
Bos taurus
Description:
ChEMBL_335897
Residue:
468
  
Inhibitor
Name:
BDBM32021
Synonyms:
4,5-bis(oxidanyl)-9,10-bis(oxidanylidene)anthracene-2-carboxylic acid 4,5-dihydroxy-9,10-dioxo-2-anthracenecarboxylic acid MLS000069639 SMR000058210 US9238626, Rhein | cid_10168
Type:
Small organic molecule
Emp. Form.:
C15H8O6
Mol. Mass.:
284.2204
SMILES:
OC(=O)c1cc(O)c2C(=O)c3c(O)cccc3C(=O)c2c1
: