Target
Beta-adrenergic receptor kinase 1
Ligand
BDBM50554259
Substrate
Meas. Tech.
ChEMBL_2048914 (CHEMBL4703613)
Kd
3330±n/a nM
Citation
 Xu, GGaul, MDLiu, ZDesJarlais, RLQi, JWang, WKrosky, DPetrounia, IMilligan, CMHermans, ALu, HRHuang, DZXu, JZSpurlino, JC Hit-to-lead optimization and discovery of a potent, and orally bioavailable G protein coupled receptor kinase 2 (GRK2) inhibitor. Bioorg Med Chem Lett 30:0 (2020)  
Target
Name:
Beta-adrenergic receptor kinase 1
Synonyms:
ADRBK1 BARK Beta-ARK-1 G-protein coupled receptor kinase 2 GRK2
Type:
Enzyme
Mol. Mass.:
79581.30
Organism:
Homo sapiens (Human)
Description:
P25098
Residue:
689
  
Inhibitor
Name:
BDBM50554259
Synonyms:
CHEMBL4788026
Type:
Small organic molecule
Emp. Form.:
C18H14N4O
Mol. Mass.:
302.33
SMILES:
O=c1n(Cc2ccccc2)cnc2cc(ccc12)-c1cn[nH]c1
: