Target
Beta-adrenergic receptor kinase 1
Ligand
BDBM22416
Substrate
Meas. Tech.
ChEMBL_2048914 (CHEMBL4703613)
Kd
2980±n/a nM
Citation
 Xu, GGaul, MDLiu, ZDesJarlais, RLQi, JWang, WKrosky, DPetrounia, IMilligan, CMHermans, ALu, HRHuang, DZXu, JZSpurlino, JC Hit-to-lead optimization and discovery of a potent, and orally bioavailable G protein coupled receptor kinase 2 (GRK2) inhibitor. Bioorg Med Chem Lett 30:0 (2020)  
Target
Name:
Beta-adrenergic receptor kinase 1
Synonyms:
ADRBK1 BARK Beta-ARK-1 G-protein coupled receptor kinase 2 GRK2
Type:
Enzyme
Mol. Mass.:
79581.30
Organism:
Homo sapiens (Human)
Description:
P25098
Residue:
689
  
Inhibitor
Name:
BDBM22416
Synonyms:
(3S,4R)-3-[(1,3-benzodioxol-5-yloxy)methyl]-4-(4-fluorophenyl)piperidine CHEMBL490 US09969700, Paroxetine [3H]Paroxetine
Type:
radiolabeled ligand
Emp. Form.:
C19H20FNO3
Mol. Mass.:
329.3654
SMILES:
Fc1ccc(cc1)[C@@H]1CCNC[C@H]1COc1ccc2OCOc2c1
: