Target
Beta-adrenergic receptor kinase 1
Ligand
BDBM50173313
Substrate
Meas. Tech.
ChEMBL_2048914 (CHEMBL4703613)
Kd
2.0±n/a nM
Citation
 Xu, GGaul, MDLiu, ZDesJarlais, RLQi, JWang, WKrosky, DPetrounia, IMilligan, CMHermans, ALu, HRHuang, DZXu, JZSpurlino, JC Hit-to-lead optimization and discovery of a potent, and orally bioavailable G protein coupled receptor kinase 2 (GRK2) inhibitor. Bioorg Med Chem Lett 30:0 (2020)  
Target
Name:
Beta-adrenergic receptor kinase 1
Synonyms:
ADRBK1 BARK Beta-ARK-1 G-protein coupled receptor kinase 2 GRK2
Type:
Enzyme
Mol. Mass.:
79581.30
Organism:
Homo sapiens (Human)
Description:
P25098
Residue:
689
  
Inhibitor
Name:
BDBM50173313
Synonyms:
CHEMBL1738878
Type:
Small organic molecule
Emp. Form.:
C24H23F2N7O
Mol. Mass.:
463.4825
SMILES:
CCCn1c(CNc2cccc(c2)C(=O)NCc2c(F)cccc2F)nnc1-c1ccncn1
: