Target
Neuropeptide Y receptor type 5
Ligand
BDBM50116601
Substrate
Meas. Tech.
ChEMBL_143678 (CHEMBL755166)
IC50
770±n/a nM
Citation
 Block, MHBoyer, SBrailsford, WBrittain, DRCarroll, DChapman, SClarke, DSDonald, CSFoote, KMGodfrey, LLadner, AMarsham, PRMasters, DJMee, CDO'Donovan, MRPease, JEPickup, AGRayner, JWRoberts, ASchofield, PSuleman, ATurnbull, AV Discovery and optimization of a series of carbazole ureas as NPY5 antagonists for the treatment of obesity. J Med Chem 45:3509-23 (2002)  
Target
Name:
Neuropeptide Y receptor type 5
Synonyms:
NPY-Y5 NPY5-R NPY5R_HUMAN NPYY5 Neuropeptide Y receptor type 5 ( NPY Y5) | Y5 receptor
Type:
Enzyme
Mol. Mass.:
50746.64
Organism:
Homo sapiens (Human)
Description:
Q15761
Residue:
445
  
Inhibitor
Name:
BDBM50116601
Synonyms:
CHEMBL118710 | Morpholine-4-carboxylic acid (4,9-diisopropyl-9H-carbazol-3-yl)-amide
Type:
Small organic molecule
Emp. Form.:
C23H29N3O2
Mol. Mass.:
379.4953
SMILES:
CC(C)c1c(NC(=O)N2CCOCC2)ccc2n(C(C)C)c3ccccc3c12
: