Target
Plasminogen activator inhibitor 1
Ligand
BDBM50116764
Substrate
Meas. Tech.
ChEBML_155614
IC50
300±n/a nM
Citation
 Wang, SGolec, JMiller, WMilutinovic, SFolkes, AWilliams, SBrooks, THardman, KCharlton, PWren, SSpencer, J Novel inhibitors of plasminogen activator inhibitor-1: development of new templates from diketopiperazines. Bioorg Med Chem Lett 12:2367-70 (2002)  
Target
Name:
Plasminogen activator inhibitor 1
Synonyms:
Endothelial plasminogen activator inhibitor PAI-1 PAI1_HUMAN Plasminogen activator inhibitor 1 Plasminogen activator inhibitor-1 SERPINE1
Type:
Enzyme
Mol. Mass.:
45064.00
Organism:
Homo sapiens (Human)
Description:
P05121
Residue:
402
  
Inhibitor
Name:
BDBM50116764
Synonyms:
3-[1-Pyridin-2-yl-meth-(Z)-ylidene]-6-[1-[4-(3-pyridin-3-yl-propoxy)-phenyl]-meth-(Z)-ylidene]-piperazine-2,5-dione | CHEMBL77246
Type:
Small organic molecule
Emp. Form.:
C25H22N4O3
Mol. Mass.:
426.4672
SMILES:
O=c1[nH]\c(=C/c2ccccn2)c(=O)[nH]\c1=C/c1ccc(OCCCc2cccnc2)cc1
: