Target
Reverse transcriptase/RNaseH
Ligand
BDBM50556159
Substrate
Meas. Tech.
ChEMBL_2055346 (CHEMBL4710347)
Ki
36±n/a nM
Citation
 Nalli, MArmijos Rivera, JIMasci, DColuccia, ABadia, RRiveira-Muñoz, EBrambilla, ACinquina, ETurriziani, OFalasca, FCatalano, MLimatola, CEsté, JAMaga, GSilvestri, RCrespan, ELa Regina, G New indolylarylsulfone non-nucleoside reverse transcriptase inhibitors show low nanomolar inhibition of single and double HIV-1 mutant strains. Eur J Med Chem 208:0 (2020)  
Target
Name:
Reverse transcriptase/RNaseH
Synonyms:
HIV-1 Reverse Transcriptase RNase H Reverse transcriptase/RNaseH
Type:
PROTEIN
Mol. Mass.:
65229.15
Organism:
Human immunodeficiency virus 1
Description:
ChEMBL_1473730
Residue:
566
  
Inhibitor
Name:
BDBM50556159
Synonyms:
CHEMBL4784247
Type:
Small organic molecule
Emp. Form.:
C24H21ClN2O4S
Mol. Mass.:
468.953
SMILES:
Cc1cc(C)cc(c1)S(=O)(=O)c1c([nH]c2ccc(Cl)cc12)C(=O)NCc1ccccc1O
: