Target
Cystic fibrosis transmembrane conductance regulator
Ligand
BDBM50556443
Substrate
Meas. Tech.
ChEMBL_2056164 (CHEMBL4711165)
EC50
410±n/a nM
Citation
 Parodi, ARighetti, GPesce, ESalis, ATasso, BUrbinati, CTomati, VDamonte, GRusnati, MPedemonte, NCichero, EMillo, E Discovery of novel VX-809 hybrid derivatives as F508del-CFTR correctors by molecular modeling, chemical synthesis and biological assays. Eur J Med Chem 208:0 (2020)  
Target
Name:
Cystic fibrosis transmembrane conductance regulator
Synonyms:
ABCC7 CFTR Channel conductance-controlling ATPase | cAMP-dependent chloride channel
Type:
Enzyme Catalytic Domain
Mol. Mass.:
168171.30
Organism:
Homo sapiens (Human)
Description:
gi_90421313
Residue:
1480
  
Inhibitor
Name:
BDBM50556443
Synonyms:
CHEMBL4793532
Type:
Small organic molecule
Emp. Form.:
C28H21ClN2O5S
Mol. Mass.:
532.995
SMILES:
COc1ccc(cc1Cl)C(=O)c1sc(NC(=O)C2(CC2)c2ccc3OCOc3c2)nc1-c1ccccc1
: