Target
Dipeptidyl peptidase 4
Ligand
BDBM50050513
Substrate
Meas. Tech.
ChEMBL_2059146 (CHEMBL4714147)
IC50
22±n/a nM
Citation
 Jung, HJNam, EHPark, JYGhosh, PKim, IS Identification of BR102910 as a selective fibroblast activation protein (FAP) inhibitor. Bioorg Med Chem Lett 37:0 (2021)  
Target
Name:
Dipeptidyl peptidase 4
Synonyms:
ADABP Adenosine deaminase complexing protein 2 CD_antigen=CD26 DPP4 DPPIV Dipeptidyl peptidase 4 (DPP IV) Dipeptidyl peptidase 4 (DPP4) Dipeptidyl peptidase 4 membrane form Dipeptidyl peptidase IV Dipeptidyl peptidase IV (DDP-IV) Dipeptidyl peptidase IV membrane form Dipeptidyl peptidase-IV (DPP-4) T-cell activation antigen CD26 | TP103
Type:
Enzyme
Mol. Mass.:
88271.01
Organism:
Homo sapiens (Human)
Description:
P27487
Residue:
766
  
Inhibitor
Name:
BDBM50050513
Synonyms:
(R)-1-((S)-2-amino-3-methylbutanoyl)pyrrolidin-2-ylboronic acid (S)-2-Amino-3-methyl-2-boronic acid-1-pyrrolidin-1-yl-butan-1-one CHEMBL67279 Pyrrolidine derivative US11504364, Compound Val-boroPro US11707539, Compound 2054
Type:
Small organic molecule
Emp. Form.:
C9H19BN2O3
Mol. Mass.:
214.07
SMILES:
CC(C)[C@H](N)C(=O)N1CCC[C@H]1B(O)O
: