Target
Transitional endoplasmic reticulum ATPase
Ligand
BDBM50424917
Substrate
Meas. Tech.
ChEMBL_2061771 (CHEMBL4717024)
IC50
11±n/a nM
Citation
 Alverez, CBulfer, SLChakrasali, RChimenti, MSDeshaies, RJGreen, NKelly, MLaPorte, MGLewis, TSLiang, MMoore, WJNeitz, RJPeshkov, VAWalters, MAZhang, FArkin, MRWipf, PHuryn, DM Allosteric Indole Amide Inhibitors of p97: Identification of a Novel Probe of the Ubiquitin Pathway. ACS Med Chem Lett 7:182-7 (2016)  
Target
Name:
Transitional endoplasmic reticulum ATPase
Synonyms:
TERA_HUMAN VCP Valosin-containing protein
Type:
Enzyme
Mol. Mass.:
89300.63
Organism:
Homo sapiens (Human)
Description:
P55072
Residue:
806
  
Inhibitor
Name:
BDBM50424917
Synonyms:
CHEMBL2311578
Type:
Small organic molecule
Emp. Form.:
C27H28N4O3S2
Mol. Mass.:
520.666
SMILES:
Cc1cc(OCc2nnc(SC3CCCC3)n2-c2cccnc2)ccc1-c1ccc(cc1)S(C)(=O)=O
: