Target
Aldo-keto reductase family 1 member B1
Ligand
BDBM50558453
Substrate
Meas. Tech.
ChEMBL_2063703 (CHEMBL4718956)
IC50
1970±n/a nM
Citation
 Saito, RSuzuki, SSasaki, K Pterin-7-carboxamides as a new class of aldose reductase inhibitors. Bioorg Med Chem Lett 26:4870-4874 (2016)  
Target
Name:
Aldo-keto reductase family 1 member B1
Synonyms:
AKR1B1 ALDR_HUMAN AR Aldose Reductase (ALR2) Aldose reductase (AR)
Type:
Protein
Mol. Mass.:
35855.50
Organism:
Homo sapiens (Human)
Description:
P15121. 4LAU; 2IKI; 4LB4; 2FZD; 2FZ8; 1US0
Residue:
316
  
Inhibitor
Name:
BDBM50558453
Synonyms:
CHEMBL4777280
Type:
Small organic molecule
Emp. Form.:
C9H8N6O4
Mol. Mass.:
264.1976
SMILES:
Nc1nc2nc(cnc2c(=O)[nH]1)C(=O)NCC(O)=O
: