Target
Gamma-aminobutyric acid receptor subunit alpha-5
Ligand
BDBM50120777
Substrate
Meas. Tech.
ChEMBL_68414 (CHEMBL680330)
EC50
38±n/a nM
Citation
 Albaugh, PAMarshall, LGregory, JWhite, GHutchison, ARoss, PCGallagher, DWTallman, JFCrago, MCassella, JV Synthesis and biological evaluation of 7,8,9,10-tetrahydroimidazo[1,2-c]pyrido[3,4-e]pyrimdin-5(6H)-ones as functionally selective ligands of the benzodiazepine receptor site on the GABA(A) receptor. J Med Chem 45:5043-51 (2002)  
Target
Name:
Gamma-aminobutyric acid receptor subunit alpha-5
Synonyms:
GABA receptor alpha-5 subunit GABRA5 Gamma-aminobutyric acid receptor subunit alpha-5 (GABA(A)) | Gamma-aminobutyric acid receptor subunit alpha-5 (GABAA)
Type:
Enzyme
Mol. Mass.:
52160.59
Organism:
Homo sapiens (Human)
Description:
P31644
Residue:
462
  
Inhibitor
Name:
BDBM50120777
Synonyms:
8-(3-Fluoro-benzoyl)-2-(2-fluoro-phenyl)-6,7,8,9-tetrahydro-5H-1,3a,5,8-tetraaza-cyclopenta[a]naphthalen-4-one | CHEMBL356806
Type:
Small organic molecule
Emp. Form.:
C22H16F2N4O2
Mol. Mass.:
406.3848
SMILES:
Fc1cccc(c1)C(=O)N1CCc2[nH]c(=O)n3cc(nc3c2C1)-c1ccccc1F
: