Target
Gamma-aminobutyric acid receptor subunit alpha-2
Ligand
BDBM50120790
Substrate
Meas. Tech.
ChEMBL_68400 (CHEMBL678889)
EC50
188±n/a nM
Citation
 Albaugh, PAMarshall, LGregory, JWhite, GHutchison, ARoss, PCGallagher, DWTallman, JFCrago, MCassella, JV Synthesis and biological evaluation of 7,8,9,10-tetrahydroimidazo[1,2-c]pyrido[3,4-e]pyrimdin-5(6H)-ones as functionally selective ligands of the benzodiazepine receptor site on the GABA(A) receptor. J Med Chem 45:5043-51 (2002)  
Target
Name:
Gamma-aminobutyric acid receptor subunit alpha-2
Synonyms:
GABA receptor alpha-2 subunit GBRA2_HUMAN | Gamma-aminobutyric acid receptor subunit alpha-2 (GABRA2)
Type:
Protein
Mol. Mass.:
51338.78
Organism:
Homo sapiens (Human)
Description:
P47869
Residue:
451
  
Inhibitor
Name:
BDBM50120790
Synonyms:
8-Benzyl-2-(2,5-difluoro-phenyl)-6,7,8,9-tetrahydro-5H-1,3a,5,8-tetraaza-cyclopenta[a]naphthalen-4-one | CHEMBL145910
Type:
Small organic molecule
Emp. Form.:
C22H18F2N4O
Mol. Mass.:
392.4013
SMILES:
Fc1ccc(F)c(c1)-c1cn2c(n1)c1CN(Cc3ccccc3)CCc1[nH]c2=O
: