Target
Gamma-aminobutyric acid receptor subunit alpha-1
Ligand
BDBM50120798
Substrate
Meas. Tech.
ChEMBL_219118 (CHEMBL823141)
EC50
118±n/a nM
Citation
 Albaugh, PAMarshall, LGregory, JWhite, GHutchison, ARoss, PCGallagher, DWTallman, JFCrago, MCassella, JV Synthesis and biological evaluation of 7,8,9,10-tetrahydroimidazo[1,2-c]pyrido[3,4-e]pyrimdin-5(6H)-ones as functionally selective ligands of the benzodiazepine receptor site on the GABA(A) receptor. J Med Chem 45:5043-51 (2002)  
Target
Name:
Gamma-aminobutyric acid receptor subunit alpha-1
Synonyms:
Benzodiazepine central GABA A Benzodiazepine liver GABA(A) receptor subunit alpha-1 GABA-A receptor GBRA1_HUMAN TBPS | agonist GABA site
Type:
Protein
Mol. Mass.:
51817.35
Organism:
Homo sapiens (Human)
Description:
P14867
Residue:
456
  
Inhibitor
Name:
BDBM50120798
Synonyms:
2-(2-Fluoro-phenyl)-8-(3H-imidazol-4-ylmethyl)-6,7,8,9-tetrahydro-5H-1,3a,5,8-tetraaza-cyclopenta[a]naphthalen-4-one | CHEMBL358874
Type:
Small organic molecule
Emp. Form.:
C19H17FN6O
Mol. Mass.:
364.3763
SMILES:
Fc1ccccc1-c1cn2c(n1)c1CN(Cc3cnc[nH]3)CCc1[nH]c2=O
: