Target
Glucagon receptor
Ligand
BDBM50122107
Substrate
Meas. Tech.
ChEMBL_72875 (CHEMBL684126)
IC50
13.8±n/a nM
Citation
 Madsen, PLing, APlewe, MSams, CKKnudsen, LBSidelmann, UGYnddal, LBrand, CLAndersen, BMurphy, DTeng, MTruesdale, LKiel, DMay, JKuki, AShi, SJohnson, MDTeston, KAFeng, JLakis, JAnderes, KGregor, VLau, J Optimization of alkylidene hydrazide based human glucagon receptor antagonists. Discovery of the highly potent and orally available 3-cyano-4-hydroxybenzoic acid [1-(2,3,5,6-tetramethylbenzyl)-1H-indol-4-ylmethylene]hydrazide. J Med Chem 45:5755-75 (2002)  
Target
Name:
Glucagon receptor
Synonyms:
GCGR GLR_HUMAN Glucagon receptor (GlucR)
Type:
Enzyme
Mol. Mass.:
54026.92
Organism:
Homo sapiens (Human)
Description:
P47871
Residue:
477
  
Inhibitor
Name:
BDBM50122107
Synonyms:
3-Chloro-4-hydroxy-benzoic acid {4-[2-(3,4-dihydro-1H-isoquinolin-2-yl)-2-oxo-ethoxy]-naphthalen-1-ylmethylene}-hydrazide | CHEMBL156772
Type:
Small organic molecule
Emp. Form.:
C29H24ClN3O4
Mol. Mass.:
513.972
SMILES:
Oc1ccc(cc1Cl)C(=O)N\N=C\c1ccc(OCC(=O)N2CCc3ccccc3C2)c2ccccc12
: