Target
Glucagon receptor
Ligand
BDBM50122146
Substrate
Meas. Tech.
ChEMBL_72875 (CHEMBL684126)
IC50
7.4±n/a nM
Citation
 Madsen, PLing, APlewe, MSams, CKKnudsen, LBSidelmann, UGYnddal, LBrand, CLAndersen, BMurphy, DTeng, MTruesdale, LKiel, DMay, JKuki, AShi, SJohnson, MDTeston, KAFeng, JLakis, JAnderes, KGregor, VLau, J Optimization of alkylidene hydrazide based human glucagon receptor antagonists. Discovery of the highly potent and orally available 3-cyano-4-hydroxybenzoic acid [1-(2,3,5,6-tetramethylbenzyl)-1H-indol-4-ylmethylene]hydrazide. J Med Chem 45:5755-75 (2002)  
Target
Name:
Glucagon receptor
Synonyms:
GCGR GLR_HUMAN Glucagon receptor (GlucR)
Type:
Enzyme
Mol. Mass.:
54026.92
Organism:
Homo sapiens (Human)
Description:
P47871
Residue:
477
  
Inhibitor
Name:
BDBM50122146
Synonyms:
3-Chloro-4-hydroxy-benzoic acid {4-[2-(2-ethyl-piperidin-1-yl)-2-oxo-ethyl]-naphthalen-1-ylmethylene}-hydrazide | CHEMBL154400
Type:
Small organic molecule
Emp. Form.:
C27H28ClN3O3
Mol. Mass.:
477.983
SMILES:
CCC1CCCCN1C(=O)Cc1ccc(\C=N\NC(=O)c2ccc(O)c(Cl)c2)c2ccccc12
: