Target
Glucagon receptor
Ligand
BDBM50122148
Substrate
Meas. Tech.
ChEMBL_72875 (CHEMBL684126)
IC50
12.3±n/a nM
Citation
 Madsen, PLing, APlewe, MSams, CKKnudsen, LBSidelmann, UGYnddal, LBrand, CLAndersen, BMurphy, DTeng, MTruesdale, LKiel, DMay, JKuki, AShi, SJohnson, MDTeston, KAFeng, JLakis, JAnderes, KGregor, VLau, J Optimization of alkylidene hydrazide based human glucagon receptor antagonists. Discovery of the highly potent and orally available 3-cyano-4-hydroxybenzoic acid [1-(2,3,5,6-tetramethylbenzyl)-1H-indol-4-ylmethylene]hydrazide. J Med Chem 45:5755-75 (2002)  
Target
Name:
Glucagon receptor
Synonyms:
GCGR GLR_HUMAN Glucagon receptor (GlucR)
Type:
Enzyme
Mol. Mass.:
54026.92
Organism:
Homo sapiens (Human)
Description:
P47871
Residue:
477
  
Inhibitor
Name:
BDBM50122148
Synonyms:
3-Chloro-4-hydroxy-benzoic acid (4-{2-[4-(4-fluoro-phenyl)-piperazin-1-yl]-2-oxo-ethyl}-naphthalen-1-ylmethylene)-hydrazide | CHEMBL346464
Type:
Small organic molecule
Emp. Form.:
C30H26ClFN4O3
Mol. Mass.:
545.004
SMILES:
Oc1ccc(cc1Cl)C(=O)N\N=C\c1ccc(CC(=O)N2CCN(CC2)c2ccc(F)cc2)c2ccccc12
: