Target
Glucagon receptor
Ligand
BDBM50122145
Substrate
Meas. Tech.
ChEMBL_72875 (CHEMBL684126)
IC50
9.2±n/a nM
Citation
 Madsen, PLing, APlewe, MSams, CKKnudsen, LBSidelmann, UGYnddal, LBrand, CLAndersen, BMurphy, DTeng, MTruesdale, LKiel, DMay, JKuki, AShi, SJohnson, MDTeston, KAFeng, JLakis, JAnderes, KGregor, VLau, J Optimization of alkylidene hydrazide based human glucagon receptor antagonists. Discovery of the highly potent and orally available 3-cyano-4-hydroxybenzoic acid [1-(2,3,5,6-tetramethylbenzyl)-1H-indol-4-ylmethylene]hydrazide. J Med Chem 45:5755-75 (2002)  
Target
Name:
Glucagon receptor
Synonyms:
GCGR GLR_HUMAN Glucagon receptor (GlucR)
Type:
Enzyme
Mol. Mass.:
54026.92
Organism:
Homo sapiens (Human)
Description:
P47871
Residue:
477
  
Inhibitor
Name:
BDBM50122145
Synonyms:
3-Chloro-4-hydroxy-benzoic acid {4-[2-(4-benzyl-piperazin-1-yl)-2-oxo-ethyl]-naphthalen-1-ylmethylene}-hydrazide | CHEMBL156904
Type:
Small organic molecule
Emp. Form.:
C31H29ClN4O3
Mol. Mass.:
541.04
SMILES:
Oc1ccc(cc1Cl)C(=O)N\N=C\c1ccc(CC(=O)N2CCN(Cc3ccccc3)CC2)c2ccccc12
: