Target
Glucagon receptor
Ligand
BDBM50122152
Substrate
Meas. Tech.
ChEMBL_72875 (CHEMBL684126)
IC50
5.9±n/a nM
Citation
 Madsen, PLing, APlewe, MSams, CKKnudsen, LBSidelmann, UGYnddal, LBrand, CLAndersen, BMurphy, DTeng, MTruesdale, LKiel, DMay, JKuki, AShi, SJohnson, MDTeston, KAFeng, JLakis, JAnderes, KGregor, VLau, J Optimization of alkylidene hydrazide based human glucagon receptor antagonists. Discovery of the highly potent and orally available 3-cyano-4-hydroxybenzoic acid [1-(2,3,5,6-tetramethylbenzyl)-1H-indol-4-ylmethylene]hydrazide. J Med Chem 45:5755-75 (2002)  
Target
Name:
Glucagon receptor
Synonyms:
GCGR GLR_HUMAN Glucagon receptor (GlucR)
Type:
Enzyme
Mol. Mass.:
54026.92
Organism:
Homo sapiens (Human)
Description:
P47871
Residue:
477
  
Inhibitor
Name:
BDBM50122152
Synonyms:
4-[(3-Chloro-4-hydroxy-benzoyl)-hydrazonomethyl]-naphthalene-1-carboxylic acid [2-(4-chloro-phenyl)-ethyl]-amide | CHEMBL152464
Type:
Small organic molecule
Emp. Form.:
C27H21Cl2N3O3
Mol. Mass.:
506.38
SMILES:
Oc1ccc(cc1Cl)C(=O)N\N=C\c1ccc(C(=O)NCCc2ccc(Cl)cc2)c2ccccc12
: