Target
Adenosine receptor A3
Ligand
BDBM50122927
Substrate
Meas. Tech.
ChEMBL_29902 (CHEMBL641973)
Ki
4.8±n/a nM
Citation
 DeNinno, MPMasamune, HChenard, LKDiRico, KJEller, CEtienne, JBTickner, JEKennedy, SPKnight, DRKong, JOleynek, JJTracey, WRHill, RJ 3'-Aminoadenosine-5'-uronamides: discovery of the first highly selective agonist at the human adenosine A3 receptor. J Med Chem 46:353-5 (2003)  
Target
Name:
Adenosine receptor A3
Synonyms:
A3 adenosine receptor (hA3) ADORA3 | Adenosine A3 receptor (A3AR)
Type:
G Protein-Coupled Receptor (GPCR)
Mol. Mass.:
36197.32
Organism:
Homo sapiens (Human)
Description:
P0DMS8
Residue:
318
  
Inhibitor
Name:
BDBM50122927
Synonyms:
(2S,3S,4R,5R)-3,4-dihydroxy-N-methyl-5-(6-(methylamino)-9H-purin-9-yl)-tetrahydrofuran-2-carboxamide CHEMBL413507
Type:
Small organic molecule
Emp. Form.:
C12H16N6O4
Mol. Mass.:
308.2932
SMILES:
CNC(=O)[C@H]1O[C@H]([C@H](O)[C@@H]1O)n1cnc2c(NC)ncnc12
: