Target
Adenosine receptor A1
Ligand
BDBM21221
Substrate
Meas. Tech.
ChEMBL_28036 (CHEMBL643032)
Ki
99±n/a nM
Citation
 DeNinno, MPMasamune, HChenard, LKDiRico, KJEller, CEtienne, JBTickner, JEKennedy, SPKnight, DRKong, JOleynek, JJTracey, WRHill, RJ 3'-Aminoadenosine-5'-uronamides: discovery of the first highly selective agonist at the human adenosine A3 receptor. J Med Chem 46:353-5 (2003)  
Target
Name:
Adenosine receptor A1
Synonyms:
A1 adenosine receptor (hA1) AA1R_HUMAN ADORA1 Adenosine A1-receptor Adenosine receptor A1 (hA1) | Adenosine transporter (AdT)
Type:
G Protein-Coupled Receptor (GPCR)
Mol. Mass.:
36520.92
Organism:
Homo sapiens (Human)
Description:
P30542
Residue:
326
  
Inhibitor
Name:
BDBM21221
Synonyms:
(2S,3S,4R,5R)-5-(2-chloro-6-{[(3-iodophenyl)methyl]amino}-9H-purin-9-yl)-3,4-dihydroxy-N-methyloxolane-2-carboxamide 2-chloro-N6-(3-iodobenzyl)adenosine-5-N-methylcarboxamide C1-IB-MECA CI-IB-MECA US20230364057, Compound 76
Type:
Small organic molecule
Emp. Form.:
C18H18ClIN6O4
Mol. Mass.:
544.731
SMILES:
CNC(=O)[C@H]1O[C@H]([C@H](O)[C@@H]1O)n1cnc2c(NCc3cccc(I)c3)nc(Cl)nc12
: