Target
Adenosine receptor A3
Ligand
BDBM50122926
Substrate
Meas. Tech.
ChEMBL_29902 (CHEMBL641973)
Ki
5.8±n/a nM
Citation
 DeNinno, MPMasamune, HChenard, LKDiRico, KJEller, CEtienne, JBTickner, JEKennedy, SPKnight, DRKong, JOleynek, JJTracey, WRHill, RJ 3'-Aminoadenosine-5'-uronamides: discovery of the first highly selective agonist at the human adenosine A3 receptor. J Med Chem 46:353-5 (2003)  
Target
Name:
Adenosine receptor A3
Synonyms:
A3 adenosine receptor (hA3) ADORA3 | Adenosine A3 receptor (A3AR)
Type:
G Protein-Coupled Receptor (GPCR)
Mol. Mass.:
36197.32
Organism:
Homo sapiens (Human)
Description:
P0DMS8
Residue:
318
  
Inhibitor
Name:
BDBM50122926
Synonyms:
3-Amino-5-{6-[5-chloro-2-(3-methyl-isoxazol-5-ylmethoxy)-benzylamino]-purin-9-yl}-4-hydroxy-tetrahydro-furan-2-carboxylic acid methylamide | CHEMBL116878
Type:
Small organic molecule
Emp. Form.:
C23H25ClN8O5
Mol. Mass.:
528.948
SMILES:
CNC(=O)[C@H]1O[C@H]([C@H](O)[C@@H]1N)n1cnc2c(NCc3cc(Cl)ccc3OCc3cc(C)no3)ncnc12
: