Target
Dual specificity protein kinase CLK3
Ligand
BDBM50363167
Substrate
Meas. Tech.
ChEMBL_2072783 (CHEMBL4728317)
Ki
26900±n/a nM
Citation
 Schröder, MBullock, ANFedorov, OBracher, FChaikuad, AKnapp, S DFG-1 Residue Controls Inhibitor Binding Mode and Affinity, Providing a Basis for Rational Design of Kinase Inhibitor Selectivity. J Med Chem 63:10224-10234 (2020)  
Target
Name:
Dual specificity protein kinase CLK3
Synonyms:
CDC2-like kinase 3 (CLK3) CLK3_HUMAN | Dual specificity protein kinase CLK3
Type:
Protein
Mol. Mass.:
73570.11
Organism:
Homo sapiens (Human)
Description:
Residue:
638
  
Inhibitor
Name:
BDBM50363167
Synonyms:
CHEMBL1945559
Type:
Small organic molecule
Emp. Form.:
C17H16Cl2N4O
Mol. Mass.:
363.241
SMILES:
Cn1c2c(C(C#N)C3(CCNCC3)NC2=O)c2ccc(Cl)c(Cl)c12
: