Target
Integrin alpha-IIb/beta-3
Ligand
BDBM50123251
Substrate
Meas. Tech.
ChEMBL_215971 (CHEMBL821000)
IC50
0.005800±n/a nM
Citation
 Bubenik, MMeerovitch, KBergeron, FAttardo, GChan, L Thiophene-based vitronectin receptor antagonists. Bioorg Med Chem Lett 13:503-6 (2003)  
Target
Name:
Integrin alpha-IIb/beta-3
Synonyms:
Glycoprotein IIb/IIIa
Type:
Mol. Mass.:
Description:
ASSAY_ID of EBI is 30109
Components:
This complex has 2 components.
Component 1
Name:
Integrin beta-3
Synonyms:
CD_antigen=CD61 GPIIIa ITGB3 Platelet membrane glycoprotein IIIa
Type:
Protein
Mol. Mass.:
87038.91
Organism:
Homo sapiens (Human)
Description:
P05106
Residue:
788
  
Component 2
Name:
Integrin alpha-IIb
Synonyms:
CD_antigen=CD41 GPIIb Glycoprotein IIb ITGA2B Integrin alpha-IIb heavy chain Integrin alpha-IIb light chain, form 2 Integrin alpha-V/beta-3 and alpha-IIb/beta 3 | Platelet membrane glycoprotein IIb
Type:
Protein
Mol. Mass.:
113354.85
Organism:
Homo sapiens (Human)
Description:
P08514
Residue:
1039
  
Inhibitor
Name:
BDBM50123251
Synonyms:
(S)-2-Benzenesulfonylamino-3-{[5-(2-guanidinomethyl-phenyl)-thiophene-2-carbonyl]-amino}-propionic acid; TFA | CHEMBL357486
Type:
Small organic molecule
Emp. Form.:
C22H23N5O5S2
Mol. Mass.:
501.579
SMILES:
[#7]\[#6](-[#7])=[#7]/[#6]-c1ccccc1-c1ccc(s1)-[#6](=O)-[#7]-[#6]-[#6@H](-[#7]S(=O)(=O)c1ccccc1)-[#6](-[#8])=O
: