Target
Interleukin-1 receptor-associated kinase 3
Ligand
BDBM50246763
Substrate
Meas. Tech.
ChEMBL_2073911 (CHEMBL4729445)
IC50
10.0±n/a nM
Citation
 Degorce, SLTavana, OBanks, ECrafter, CGingipalli, LKouvchinov, DMao, YPachl, FSolanki, AValge-Archer, VYang, BEdmondson, SD Discovery of Proteolysis-Targeting Chimera Molecules that Selectively Degrade the IRAK3 Pseudokinase. J Med Chem 63:10460-10473 (2020)  
Target
Name:
Interleukin-1 receptor-associated kinase 3
Synonyms:
IL-1 receptor-associated kinase M IRAK-M IRAK3_HUMAN
Type:
PROTEIN
Mol. Mass.:
67767.98
Organism:
Homo sapiens (Human)
Description:
EBI_101055
Residue:
596
  
Inhibitor
Name:
BDBM50246763
Synonyms:
CHEMBL4094760
Type:
Small organic molecule
Emp. Form.:
C21H31N5O2
Mol. Mass.:
385.5031
SMILES:
C1CC(CCO1)c1c[nH]c2ncnc(N[C@H]3CC[C@H](CC3)N3CCOCC3)c12
: