Target
Interleukin-1 receptor-associated kinase 3
Ligand
BDBM50560894
Substrate
Meas. Tech.
ChEMBL_2073911 (CHEMBL4729445)
IC50
50±n/a nM
Citation
 Degorce, SLTavana, OBanks, ECrafter, CGingipalli, LKouvchinov, DMao, YPachl, FSolanki, AValge-Archer, VYang, BEdmondson, SD Discovery of Proteolysis-Targeting Chimera Molecules that Selectively Degrade the IRAK3 Pseudokinase. J Med Chem 63:10460-10473 (2020)  
Target
Name:
Interleukin-1 receptor-associated kinase 3
Synonyms:
IL-1 receptor-associated kinase M IRAK-M IRAK3_HUMAN
Type:
PROTEIN
Mol. Mass.:
67767.98
Organism:
Homo sapiens (Human)
Description:
EBI_101055
Residue:
596
  
Inhibitor
Name:
BDBM50560894
Synonyms:
CHEMBL4778668
Type:
Small organic molecule
Emp. Form.:
C43H59N9O9
Mol. Mass.:
845.9835
SMILES:
CC(C)c1ccn2ncnc(N[C@H]3CC[C@H](CC3)N3CCN(CC3)C(=O)CCOCCOCCOCCOCCNc3cccc4C(=O)N(C5CCC(=O)NC5=O)C(=O)c34)c12
: