Target
Interleukin-1 receptor-associated kinase 3
Ligand
BDBM50560903
Substrate
Meas. Tech.
ChEMBL_2073911 (CHEMBL4729445)
IC50
22±n/a nM
Citation
 Degorce, SLTavana, OBanks, ECrafter, CGingipalli, LKouvchinov, DMao, YPachl, FSolanki, AValge-Archer, VYang, BEdmondson, SD Discovery of Proteolysis-Targeting Chimera Molecules that Selectively Degrade the IRAK3 Pseudokinase. J Med Chem 63:10460-10473 (2020)  
Target
Name:
Interleukin-1 receptor-associated kinase 3
Synonyms:
IL-1 receptor-associated kinase M IRAK-M IRAK3_HUMAN
Type:
PROTEIN
Mol. Mass.:
67767.98
Organism:
Homo sapiens (Human)
Description:
EBI_101055
Residue:
596
  
Inhibitor
Name:
BDBM50560903
Synonyms:
CHEMBL4746543
Type:
Small organic molecule
Emp. Form.:
C46H64N10O10
Mol. Mass.:
917.0614
SMILES:
CC(C)c1ccn2ncnc(N[C@H]3CC[C@H](CC3)N3CCN(CC3)C(=O)CCC(=O)NCCOCCOCCOCCOCCNc3cccc4C(=O)N(C5CCC(=O)NC5=O)C(=O)c34)c12
: