Target
Interleukin-1 receptor-associated kinase 3
Ligand
BDBM50560888
Substrate
Meas. Tech.
ChEMBL_2073911 (CHEMBL4729445)
IC50
5.0±n/a nM
Citation
 Degorce, SLTavana, OBanks, ECrafter, CGingipalli, LKouvchinov, DMao, YPachl, FSolanki, AValge-Archer, VYang, BEdmondson, SD Discovery of Proteolysis-Targeting Chimera Molecules that Selectively Degrade the IRAK3 Pseudokinase. J Med Chem 63:10460-10473 (2020)  
Target
Name:
Interleukin-1 receptor-associated kinase 3
Synonyms:
IL-1 receptor-associated kinase M IRAK-M IRAK3_HUMAN
Type:
PROTEIN
Mol. Mass.:
67767.98
Organism:
Homo sapiens (Human)
Description:
EBI_101055
Residue:
596
  
Inhibitor
Name:
BDBM50560888
Synonyms:
CHEMBL4749646
Type:
Small organic molecule
Emp. Form.:
C47H63N11O6
Mol. Mass.:
878.0732
SMILES:
CC(C)c1ccn2ncnc(N[C@H]3CC[C@H](CC3)N3CCN(CC3)C(=O)CCC(=O)N3CCC(CCN4CCN(CC4)c4ccc5C(=O)N(C6CCC(=O)NC6=O)C(=O)c5c4)CC3)c12
: