Target
Serine/threonine-protein kinase haspin
Ligand
BDBM50560888
Substrate
Meas. Tech.
ChEMBL_2073916 (CHEMBL4729450)
IC50
110±n/a nM
Citation
 Degorce, SLTavana, OBanks, ECrafter, CGingipalli, LKouvchinov, DMao, YPachl, FSolanki, AValge-Archer, VYang, BEdmondson, SD Discovery of Proteolysis-Targeting Chimera Molecules that Selectively Degrade the IRAK3 Pseudokinase. J Med Chem 63:10460-10473 (2020)  
Target
Name:
Serine/threonine-protein kinase haspin
Synonyms:
GSG2 H-haspin HASP_HUMAN | Haploid germ cell-specific nuclear protein kinase
Type:
PROTEIN
Mol. Mass.:
88531.28
Organism:
Homo sapiens (Human)
Description:
ChEMBL_1510616
Residue:
798
  
Inhibitor
Name:
BDBM50560888
Synonyms:
CHEMBL4749646
Type:
Small organic molecule
Emp. Form.:
C47H63N11O6
Mol. Mass.:
878.0732
SMILES:
CC(C)c1ccn2ncnc(N[C@H]3CC[C@H](CC3)N3CCN(CC3)C(=O)CCC(=O)N3CCC(CCN4CCN(CC4)c4ccc5C(=O)N(C6CCC(=O)NC6=O)C(=O)c5c4)CC3)c12
: