Target
Integrase
Ligand
BDBM107681
Substrate
Meas. Tech.
ChEMBL_88596 (CHEMBL699988)
IC50
480±n/a nM
Citation
 Zhang, XPais, GCSvarovskaia, ESMarchand, CJohnson, AAKarki, RGNicklaus, MCPathak, VKPommier, YBurke, TR Azido-containing aryl beta-diketo acid HIV-1 integrase inhibitors. Bioorg Med Chem Lett 13:1215-9 (2003)  
Target
Name:
Integrase
Synonyms:
Human immunodeficiency virus type 1 integrase
Type:
PROTEIN
Mol. Mass.:
32231.48
Organism:
Human immunodeficiency virus 1
Description:
ChEMBL_90865
Residue:
288
  
Inhibitor
Name:
BDBM107681
Synonyms:
(2Z)-4-[3,5-bis(benzyloxy)phenyl]-2-hydroxy-4- oxobut-2-enoic acid (Compound 2) CHEMBL320261
Type:
Small organic molecule
Emp. Form.:
C24H20O6
Mol. Mass.:
404.412
SMILES:
OC(=O)C(=O)CC(=O)c1cc(OCc2ccccc2)cc(OCc2ccccc2)c1
: