Target
Beta-3 adrenergic receptor
Ligand
BDBM50126061
Substrate
Meas. Tech.
ChEMBL_38788 (CHEMBL653162)
EC50
240±n/a nM
Citation
 Harada, HHirokawa, YSuzuki, KHiyama, YOue, MKawashima, HYoshida, NFurutani, YKato, S Novel and potent human and rat beta3-adrenergic receptor agonists containing substituted 3-indolylalkylamines. Bioorg Med Chem Lett 13:1301-5 (2003)  
Target
Name:
Beta-3 adrenergic receptor
Synonyms:
ADRB3 ADRB3_HUMAN Beta-2 adrenergic receptor and beta-3 adrenergic receptor Beta-3 adrenoreceptor | adrenergic Beta3
Type:
G Protein-Coupled Receptor (GPCR)
Mol. Mass.:
43534.88
Organism:
Homo sapiens (Human)
Description:
Residue:
408
  
Inhibitor
Name:
BDBM50126061
Synonyms:
(R)-1-((S)-3-Chloro-phenyl)-2-[2-(1H-indol-3-yl)-1-methyl-ethylamino]-ethanol | CHEMBL25823
Type:
Small organic molecule
Emp. Form.:
C19H21ClN2O
Mol. Mass.:
328.836
SMILES:
C[C@@H](Cc1c[nH]c2ccccc12)NC[C@H](O)c1cccc(Cl)c1
: