Target
Progesterone receptor
Ligand
BDBM50404211
Substrate
Meas. Tech.
ChEMBL_205981 (CHEMBL810910)
EC50
>3000±n/a nM
Citation
 Fensome, AKoko, MWrobel, JZhang, PZhang, ZCohen, JLundeen, SRudnick, KZhu, YWinneker, R Novel 5-aryl-1,3-dihydro-indole-2-thiones. potent, orally active progesterone receptor agonists. Bioorg Med Chem Lett 13:1317-20 (2003)  
Target
Name:
Progesterone receptor
Synonyms:
NR3C3 PGR PRGR_HUMAN | progesterone
Type:
Protein
Mol. Mass.:
98979.52
Organism:
Homo sapiens (Human)
Description:
P06401
Residue:
933
  
Inhibitor
Name:
BDBM50404211
Synonyms:
CHEMBL25182
Type:
Small organic molecule
Emp. Form.:
C20H20ClNS
Mol. Mass.:
341.898
SMILES:
CN1C(=S)C2(CCCCC2)c2cc(ccc12)-c1cccc(Cl)c1
: